Target
Isoform Tau-F of Microtubule-associated protein tau
Ligand
BDBM214746
Substrate
Meas. Tech.
Tau Protein Assay
pH
7.4±n/a
IC50
7.5e+2±n/a nM
Comments
extracted
Citation
 Schafer, KNCisek, KHuseby, CJChang, EKuret, J Structural determinants of Tau aggregation inhibitor potency. J Biol Chem 288:32599-611 (2013)  
Target
Name:
Isoform Tau-F of Microtubule-associated protein tau
Synonyms:
MAPT MTBT1 Microtubule-associated protein Tau isoform 2N4R (Tau 2N4R) TAU | TAU_HUMAN
Type:
Enzyme Catalytic Domain
Mol. Mass.:
45857.42
Organism:
Homo sapiens (Human)
Description:
P10636-8
Residue:
441
  
Inhibitor
Name:
BDBM214746
Synonyms:
Rhodanines, 34A
Type:
Small organic molecule
Emp. Form.:
C24H16N3O5S2
Mol. Mass.:
490.531
SMILES:
[O-]C(=O)c1ccc(o1)-c1ccc(cc1)-c1ccc(\C=C2/SC(=S)N(CCc3c[nH]cn3)C2=O)o1
: