Target
Cytochrome P450 2B6
Ligand
BDBM214688
Substrate
BDBM50048392
Meas. Tech.
CYP450 Inhibition Assay
Temperature
310.15±n/a K
IC50
>40000±n/a nM
Comments
extracted
Citation
 Holladay, MWSetti, E Optically active pyrazolylaminoquinazoline, and pharmaceutical compositions and methods of use thereof US Patent  US9295672 Publication Date 3/29/2016 
Target
Name:
Cytochrome P450 2B6
Synonyms:
CP2B6_HUMAN Cytochrome P450 2B6 (CYP2B6)
Type:
Protein
Mol. Mass.:
56289.75
Organism:
Homo sapiens (Human)
Description:
P20813
Residue:
491
  
Inhibitor
Name:
BDBM214688
Synonyms:
US9295672, (4-fluorophenyl)(4-((5-methyl-1H-pyrazol-3-yl)amino)quinazolin-2-yl)methanol
Type:
Small organic molecule
Emp. Form.:
C19H16FN5O
Mol. Mass.:
349.3616
SMILES:
Cc1cc(Nc2nc(nc3ccccc23)C(O)c2ccc(F)cc2)n[nH]1
:
Substrate
Name:
BDBM50048392
Synonyms:
2-(tert-butylamino)-1-(3-chlorophenyl)propan-1-one BUPROPION HYDROCHLORIDE US9944618, Compound ID No. 176
Type:
Small organic molecule
Emp. Form.:
C13H18ClNO
Mol. Mass.:
239.741
SMILES:
CC(NC(C)(C)C)C(=O)c1cccc(Cl)c1
: