Target
Bifunctional epoxide hydrolase 2
Ligand
BDBM50327819
Substrate
Meas. Tech.
Fluorescent Based Assay
pH
7±n/a
IC50
8.7±n/a nM
Comments
extracted
Citation
 Hammock, BDRose, TMorisseau, CLee, KS Acyl piperidine inhibitors of soluble epoxide hydrolase US Patent  US9296693 Publication Date 3/29/2016 
Target
Name:
Bifunctional epoxide hydrolase 2
Synonyms:
Eph2 Epoxide hydratase Soluble epoxide hydrolase (sEH)
Type:
Enzyme
Mol. Mass.:
62512.06
Organism:
Mus musculus (Mouse)
Description:
P34914
Residue:
554
  
Inhibitor
Name:
BDBM50327819
Synonyms:
1-(1-Propionylpiperidin-4-yl)-3-m-tolylurea US9296693, 11
Type:
Small organic molecule
Emp. Form.:
C16H23N3O2
Mol. Mass.:
289.3727
SMILES:
CCC(=O)N1CCC(CC1)NC(=O)Nc1cccc(C)c1
: