Target
Monocarboxylate transporter 1
Ligand
BDBM50092057
Substrate
Meas. Tech.
Inhibition Assay
pH
7.43±n/a
Temperature
310.15±n/a K
IC50
26±n/a nM
Comments
extracted
Citation
 Mereddy, VRDrewes, LRAlam, MAJonnalagadda, SKGurrapu, S Therapeutic compounds US Patent  US9296728 Publication Date 3/29/2016 
Target
Name:
Monocarboxylate transporter 1
Synonyms:
MCT 1 Mct1 Monocarboxylate transporter 1 (MCT1) Solute carrier family 16 member 1
Type:
Enzyme
Mol. Mass.:
53245.17
Organism:
Rattus norvegicus (Rat)
Description:
P53987
Residue:
494
  
Inhibitor
Name:
BDBM50092057
Synonyms:
CHEMBL3582409 | US9296728, 4
Type:
Small organic molecule
Emp. Form.:
C18H24N2O2
Mol. Mass.:
300.3954
SMILES:
CCCCN(CCCC)c1ccc(\C=C(/C#N)C(O)=O)cc1
: