Target
Monocarboxylate transporter 1
Ligand
BDBM214701
Substrate
Meas. Tech.
Inhibition Assay
pH
7.43±n/a
Temperature
310.15±n/a K
IC50
150±n/a nM
Comments
extracted
Citation
 Mereddy, VRDrewes, LRAlam, MAJonnalagadda, SKGurrapu, S Therapeutic compounds US Patent  US9296728 Publication Date 3/29/2016 
Target
Name:
Monocarboxylate transporter 1
Synonyms:
MCT 1 Mct1 Monocarboxylate transporter 1 (MCT1) Solute carrier family 16 member 1
Type:
Enzyme
Mol. Mass.:
53245.17
Organism:
Rattus norvegicus (Rat)
Description:
P53987
Residue:
494
  
Inhibitor
Name:
BDBM214701
Synonyms:
US9296728, 24
Type:
Small organic molecule
Emp. Form.:
C16H11NO4
Mol. Mass.:
281.2628
SMILES:
OC(=O)c1cc2ccc(cc2oc1=O)N(CC#C)CC#C
: