Target
Histone deacetylase 11
Ligand
BDBM50005711
Substrate
Meas. Tech.
HDAC Cell-Free Assays
pH
8±n/a
IC50
18.3±0.0 nM
Comments
extracted
Citation
 Cao, BLi, JZhu, JShen, MHan, KZhang, ZYu, YWang, YWu, DChen, SSun, ATang, XZhao, YQiao, CHou, TMao, X The antiparasitic clioquinol induces apoptosis in leukemia and myeloma cells by inhibiting histone deacetylase activity. J Biol Chem 288:34181-9 (2013)  
Target
Name:
Histone deacetylase 11
Synonyms:
HD11 HDAC11 | Human HDAC11
Type:
Chromatin regulator; hydrolase; repressor
Mol. Mass.:
39187.66
Organism:
Homo sapiens (Human)
Description:
Q96DB2
Residue:
347
  
Inhibitor
Name:
BDBM50005711
Synonyms:
CHEBI:46024 TRICHOSTATIN Trichostatin A (TSA) US10722597, Compound Trichostatin US20230322747, Compound trichostatin A | US9265734, TSA
Type:
Small organic molecule
Emp. Form.:
C17H22N2O3
Mol. Mass.:
302.3682
SMILES:
C[C@H](\C=C(/C)\C=C\C(=O)NO)C(=O)c1ccc(cc1)N(C)C
: