Target
Orotate phosphoribosyltransferase
Ligand
BDBM214787
Substrate
Meas. Tech.
Inhibition Assay
pH
8±n/a
Temperature
298.15±n/a K
Ki
690±190 nM
Comments
extracted
Citation
 Zhang, YEvans, GBClinch, KCrump, DRHarris, LDFröhlich, RFTyler, PCHazleton, KZCassera, MBSchramm, VL Transition state analogues of Plasmodium falciparum and human orotate phosphoribosyltransferases. J Biol Chem 288:34746-54 (2013)  
Target
Name:
Orotate phosphoribosyltransferase
Synonyms:
Orotate phosphoribosyltransferase (PfOPRT)
Type:
Enzyme
Mol. Mass.:
33007.07
Organism:
Plasmodium falciparum
Description:
Q8I3Y0
Residue:
281
  
Inhibitor
Name:
BDBM214787
Synonyms:
OPRT inhibitor, 10
Type:
Small organic molecule
Emp. Form.:
C12H18N3O7
Mol. Mass.:
316.2867
SMILES:
OC[C@@H]1C(O)C(O)C[NH+]1CCn1c(cc(=O)[nH]c1=O)C(O)=O
: