Target
Orotate phosphoribosyltransferase
Ligand
BDBM214791
Substrate
Meas. Tech.
Inhibition Assay
pH
8±n/a
Temperature
298.15±n/a K
Ki
220±80 nM
Comments
extracted
Citation
 Zhang, YEvans, GBClinch, KCrump, DRHarris, LDFröhlich, RFTyler, PCHazleton, KZCassera, MBSchramm, VL Transition state analogues of Plasmodium falciparum and human orotate phosphoribosyltransferases. J Biol Chem 288:34746-54 (2013)  
Target
Name:
Orotate phosphoribosyltransferase
Synonyms:
Orotate phosphoribosyltransferase (PfOPRT)
Type:
Enzyme
Mol. Mass.:
33007.07
Organism:
Plasmodium falciparum
Description:
Q8I3Y0
Residue:
281
  
Inhibitor
Name:
BDBM214791
Synonyms:
OPRT inhibitor, 14
Type:
Small organic molecule
Emp. Form.:
C11H16N3O6
Mol. Mass.:
286.2607
SMILES:
OC[C@H]1C[N@@H+](Cc2c([nH]c(=O)[nH]c2=O)C(O)=O)CC1O
: