Target
Kappa-type opioid receptor [Y119F]
Ligand
BDBM214799
Substrate
Meas. Tech.
Homologous Competition Assay
pH
7.4±n/a
Temperature
298.15±n/a K
Ki
5.2e+2±7e+1 nM
Comments
extracted
Citation
 Vardy, EMosier, PDFrankowski, KJWu, HKatritch, VWestkaemper, RBAubé, JStevens, RCRoth, BL Chemotype-selective modes of action of ¿-opioid receptor agonists. J Biol Chem 288:34470-83 (2013)  
Target
Name:
Kappa-type opioid receptor [Y119F]
Synonyms:
Kappa opioid receptor (KOR Y119F) OPRK1 | OPRK_HUMAN
Type:
Protein
Mol. Mass.:
42632.76
Organism:
Homo sapiens (Human)
Description:
Human KOR with Y119F mutation
Residue:
380
  
Inhibitor
Name:
BDBM214799
Synonyms:
1xx
Type:
Small organic molecule
Emp. Form.:
C24H22ClF3N2O2
Mol. Mass.:
462.892
SMILES:
FC(F)(F)c1cc(NC(=O)[C@H]2CC=C[C@H]3CCN(Cc4ccccc4)C(=O)[C@@H]23)ccc1Cl
: