Target
Tyrosine-protein kinase ITK/TSK
Ligand
BDBM290149
Substrate
Meas. Tech.
Enzymatic Activity Assay
pH
7.5±n/a
IC50
7.00±n/a nM
Comments
extracted
Citation
 Brameld, KAOwens, T Benzimidazole derivatives as ITK inhibitors US Patent  US9573958 Publication Date 2/21/2017 
Target
Name:
Tyrosine-protein kinase ITK/TSK
Synonyms:
EMT ITK_HUMAN LYK Tyrosine-protein kinase ITK Tyrosine-protein kinase Lyk
Type:
Protein
Mol. Mass.:
71839.20
Organism:
Homo sapiens (Human)
Description:
Q08881
Residue:
620
  
Inhibitor
Name:
BDBM290149
Synonyms:
US9573958, Compound 33
Type:
Small organic molecule
Emp. Form.:
C28H35ClN5O2
Mol. Mass.:
509.063
SMILES:
C[C@H](NCc1ccc2n(CC3CCCN3[C](=C)=O)c(NC(=O)c3ccc(Cl)cc3)nc2c1)C(C)(C)C
: