Target
Tyrosine-protein kinase ITK/TSK
Ligand
BDBM290173
Substrate
Meas. Tech.
Enzymatic Activity Assay
pH
7.5±n/a
IC50
10.3±n/a nM
Comments
extracted
Citation
 Brameld, KAOwens, T Benzimidazole derivatives as ITK inhibitors US Patent  US9573958 Publication Date 2/21/2017 
Target
Name:
Tyrosine-protein kinase ITK/TSK
Synonyms:
EMT ITK_HUMAN LYK Tyrosine-protein kinase ITK Tyrosine-protein kinase Lyk
Type:
Protein
Mol. Mass.:
71839.20
Organism:
Homo sapiens (Human)
Description:
Q08881
Residue:
620
  
Inhibitor
Name:
BDBM290173
Synonyms:
US9573958, Compound 116
Type:
Small organic molecule
Emp. Form.:
C30H36F2N6O3S
Mol. Mass.:
598.707
SMILES:
CC(C)C=C(C#N)C(=O)N1CCC[C@@H]1Cn1c(NC(=O)c2ccc(s2)C(F)F)nc2cc(CNCC(C)(C)O)ccc12
: