Target
Tyrosine-protein kinase ITK/TSK
Ligand
BDBM290236
Substrate
Meas. Tech.
Enzymatic Activity Assay
pH
7.5±n/a
IC50
680±n/a nM
Comments
extracted
Citation
 Brameld, KAOwens, T Benzimidazole derivatives as ITK inhibitors US Patent  US9573958 Publication Date 2/21/2017 
Target
Name:
Tyrosine-protein kinase ITK/TSK
Synonyms:
EMT ITK_HUMAN LYK Tyrosine-protein kinase ITK Tyrosine-protein kinase Lyk
Type:
Protein
Mol. Mass.:
71839.20
Organism:
Homo sapiens (Human)
Description:
Q08881
Residue:
620
  
Inhibitor
Name:
BDBM290236
Synonyms:
US9573958, Compound 129
Type:
Small organic molecule
Emp. Form.:
C32H40F2N6O2S
Mol. Mass.:
610.761
SMILES:
C[C@H](NCc1ccc2n(CC3CN(C3)C(=O)C(=CC(C)(C)C)C#N)c(NC(=O)c3ccc(s3)C(F)F)nc2c1)C(C)(C)C
: