Target
Diacylglycerol O-acyltransferase 2
Ligand
BDBM215457
Substrate
Meas. Tech.
In Vitro DGAT2 Assay
pH
7.4±n/a
Temperature
298.15±n/a K
IC50
54.7±n/a nM
Comments
extracted
Citation
 Ahn, KBoehm, MCabral, SCarpino, PAFutatsugi, KHepworth, DKung, DWOrr, SWang, J Diacylglycerol acyltransferase 2 inhibitors US Patent  US9296745 Publication Date 3/29/2016 
Target
Name:
Diacylglycerol O-acyltransferase 2
Synonyms:
ARAT DGAT2 Diacylglycerol O-acyltransferase 2 (DGAT2) Retinol O-fatty-acyltransferase
Type:
Multi-pass membrane protein
Mol. Mass.:
43848.90
Organism:
Homo sapiens (Human)
Description:
Q96PD7
Residue:
388
  
Inhibitor
Name:
BDBM215457
Synonyms:
US9296745, 12
Type:
Small organic molecule
Emp. Form.:
C23H25N7O
Mol. Mass.:
415.4909
SMILES:
O=C([C@@H]1CCCN(C1)c1ccc2nc([nH]c2n1)-c1cccc2ccnn12)N1CCCC1
: