Target
Diacylglycerol O-acyltransferase 2
Ligand
BDBM215551
Substrate
Meas. Tech.
DGAT2 Cell-Based Assay
IC50
2.8±n/a nM
Citation
 Ahn, KBoehm, MCabral, SCarpino, PAFutatsugi, KHepworth, DKung, DWOrr, SWang, J Diacylglycerol acyltransferase 2 inhibitors US Patent  US9296745 Publication Date 3/29/2016 
Target
Name:
Diacylglycerol O-acyltransferase 2
Synonyms:
ARAT DGAT2 Diacylglycerol O-acyltransferase 2 (DGAT2) Retinol O-fatty-acyltransferase
Type:
Multi-pass membrane protein
Mol. Mass.:
43848.90
Organism:
Homo sapiens (Human)
Description:
Q96PD7
Residue:
388
  
Inhibitor
Name:
BDBM215551
Synonyms:
US9296745, 108
Type:
Small organic molecule
Emp. Form.:
C21H25ClN8O
Mol. Mass.:
440.929
SMILES:
Clc1cnn(c1)C1(CC1)c1nc2cnc(nc2[nH]1)N1CCC[C@H](C1)C(=O)N1CCCC1
: