Target
Bromodomain-containing protein 4 [44-168]
Ligand
BDBM215714
Substrate
Meas. Tech.
AlphaScreen Assay
IC50
19±n/a nM
Citation
 Engelhardt, HMartin, LSmethurst, C Pyridinones US Patent  US9296748 Publication Date 3/29/2016 
Target
Name:
Bromodomain-containing protein 4 [44-168]
Synonyms:
BET bromodomain 4(1) (BRD4(1)) BRD4-BD1 protein (aa 44-168) Bromodomain protein 4 (BRD4-BD1) Bromodomain-containing protein 4 (BRD4) (aa 44-168) Bromodomain-containing protein 4 bromodomain 1 (BRD4-BD1) | HUNK1
Type:
Enzyme Catalytic Domain
Mol. Mass.:
14866.49
Organism:
Homo sapiens (Human)
Description:
aa (44-168)
Residue:
125
  
Inhibitor
Name:
BDBM215714
Synonyms:
US9296748, II-1
Type:
Small organic molecule
Emp. Form.:
C25H28N6O
Mol. Mass.:
428.5294
SMILES:
CN1CCN(CC1)c1cc2n(Cc3ccccc3)c(nc2cn1)-c1cc(C)c(=O)n(C)c1
: