Target
Myeloperoxidase
Ligand
BDBM217355
Substrate
Meas. Tech.
Myeloperoxidase Assay
pH
6.5±n/a
IC50
25.1± 0.3 nM
Comments
extracted
Citation
 Forbes, LVSjögren, TAuchère, FJenkins, DWThong, BLaughton, DHemsley, PPairaudeau, GTurner, REriksson, HUnitt, JFKettle, AJ Potent reversible inhibition of myeloperoxidase by aromatic hydroxamates. J Biol Chem 288:36636-47 (2013)  
Target
Name:
Myeloperoxidase
Synonyms:
84 kDa myeloperoxidase MPO Myeloperoxidase Myeloperoxidase heavy chain PERM_HUMAN
Type:
Enzyme
Mol. Mass.:
83888.32
Organism:
Homo sapiens (Human)
Description:
P05164
Residue:
745
  
Inhibitor
Name:
BDBM217355
Synonyms:
4-benzyl-2-hydroxybenzenecarbohydroxamic acid (HX2)
Type:
Small organic molecule
Emp. Form.:
C14H13NO3
Mol. Mass.:
243.2579
SMILES:
ONC(=O)c1ccc(Cc2ccccc2)cc1O
: