Target
Myeloperoxidase
Ligand
BDBM217356
Substrate
Meas. Tech.
Myeloperoxidase Assay
pH
6.5±n/a
IC50
7.9e+2± 1e+1 nM
Comments
extracted
Citation
 Forbes, LVSjögren, TAuchère, FJenkins, DWThong, BLaughton, DHemsley, PPairaudeau, GTurner, REriksson, HUnitt, JFKettle, AJ Potent reversible inhibition of myeloperoxidase by aromatic hydroxamates. J Biol Chem 288:36636-47 (2013)  
Target
Name:
Myeloperoxidase
Synonyms:
84 kDa myeloperoxidase MPO Myeloperoxidase Myeloperoxidase heavy chain PERM_HUMAN
Type:
Enzyme
Mol. Mass.:
83888.32
Organism:
Homo sapiens (Human)
Description:
P05164
Residue:
745
  
Inhibitor
Name:
BDBM217356
Synonyms:
2-(benzylamino)-6-oxo-3H-pyrimidine-5-carbohydroxamic acid (HX3)
Type:
Small organic molecule
Emp. Form.:
C12H12N4O3
Mol. Mass.:
260.2487
SMILES:
ONC(=O)c1c[nH]c(NCc2ccccc2)nc1=O
: