Target
Thyroid peroxidase
Ligand
BDBM217355
Substrate
Meas. Tech.
LPO/TPO Selectivity Assay
IC50
63± 1 nM
Citation
 Forbes, LVSjögren, TAuchère, FJenkins, DWThong, BLaughton, DHemsley, PPairaudeau, GTurner, REriksson, HUnitt, JFKettle, AJ Potent reversible inhibition of myeloperoxidase by aromatic hydroxamates. J Biol Chem 288:36636-47 (2013)  
Target
Name:
Thyroid peroxidase
Synonyms:
PERT_HUMAN Thyroid peroxidase | Thyroid peroxidase (TPO)
Type:
Enzyme
Mol. Mass.:
102965.07
Organism:
Homo sapiens (Human)
Description:
P07202
Residue:
933
  
Inhibitor
Name:
BDBM217355
Synonyms:
4-benzyl-2-hydroxybenzenecarbohydroxamic acid (HX2)
Type:
Small organic molecule
Emp. Form.:
C14H13NO3
Mol. Mass.:
243.2579
SMILES:
ONC(=O)c1ccc(Cc2ccccc2)cc1O
: