Target
Plasminogen [101-181]
Ligand
BDBM290290
Substrate
Meas. Tech.
Biacore Assay
pH
7±n/a
IC50
97.0±n/a nM
Comments
extracted
Citation
 Haßfeld, JKinzel, TKöbberling, JCancho-Grande, YBeyer, KRöhrig, SKöllnberger, MSperzel, MBurkhardt, NSchlemmer, KStegmann, CSchuhmacher, JWerner, MEllermann, M (Aza)pyridopyrazolopyrimidinones and indazolopyrimidinones and their use US Patent  US10098883 Publication Date 10/16/2018 
Target
Name:
Plasminogen [101-181]
Synonyms:
PLG Plasminogen (aa 101-181)
Type:
Enzyme Catalytic Domain
Mol. Mass.:
9281.08
Organism:
Homo sapiens (Human)
Description:
P00747[101-181]
Residue:
81
  
Inhibitor
Name:
BDBM290290
Synonyms:
10-Nitro-4-(piperidin-4-yl)-8-(trifluoromethyl)pyrimido[1,2-b]indazol-2(1H)-one hydrochloride US10668071, Example 31
Type:
Small organic molecule
Emp. Form.:
C16H14F3N5O3
Mol. Mass.:
381.3093
SMILES:
[O-][N+](=O)c1cc(cc2nn3c(cc(=O)[nH]c3c12)C1CCNCC1)C(F)(F)F
: