Target
Proprotein convertase subtilisin/kexin type 9
Ligand
BDBM217363
Substrate
Meas. Tech.
PCSK9 Inhibition Assay
IC50
6.2e+3± 5e+2 nM
Citation
 Zhang, YEigenbrot, CZhou, LShia, SLi, WQuan, CTom, JMoran, PDi Lello, PSkelton, NJKong-Beltran, MPeterson, AKirchhofer, D Identification of a small peptide that inhibits PCSK9 protein binding to the low density lipoprotein receptor. J Biol Chem 289:942-55 (2014)  
Target
Name:
Proprotein convertase subtilisin/kexin type 9
Synonyms:
NARC-1 Neural apoptosis-regulated convertase 1 PCSK9 Proprotein convertase 9 Proprotein convertase subtilisin/kexin type 9 (PCSK9) Subtilisin/kexin-like protease PC9
Type:
Enzyme
Mol. Mass.:
74286.93
Organism:
Homo sapiens (Human)
Description:
Q8NBP7
Residue:
692
  
Inhibitor
Name:
BDBM217363
Synonyms:
Pep2-2ΔV13 | TVFTSWEEYLLW
Type:
Small organic molecule
Emp. Form.:
C80H107N15O21
Mol. Mass.:
1614.7935
SMILES:
CC(C)C[C@H](NC(=O)[C@H](CC(C)C)NC(=O)[C@H](Cc1ccc(O)cc1)NC(=O)[C@H](CCC(O)=O)NC(=O)[C@H](CCC(O)=O)NC(=O)[C@H](Cc1c[nH]c2ccccc12)NC(=O)[C@H](CO)NC(=O)[C@@H](NC(=O)[C@H](Cc1ccccc1)NC(=O)[C@@H](NC(=O)[C@@H](NC(C)=O)[C@@H](C)O)C(C)C)[C@@H](C)O)C(=O)N[C@@H](Cc1c[nH]c2ccccc12)C(N)=O
: