Target
Cytochrome P450 2D6
Ligand
BDBM155254
Substrate
Meas. Tech.
Assessment of CYP Inhibition
IC50
>100±0.0 nM
Citation
 Kuntz, KWCampbell, JESeki, M Substituted benzene compounds US Patent  US10098888 Publication Date 10/16/2018 
Target
Name:
Cytochrome P450 2D6
Synonyms:
CP2D6_HUMAN CYP2DL1 Cytochrome P450 2D6 (CYP2D6) P450-DB1
Type:
Protein
Mol. Mass.:
55774.82
Organism:
Homo sapiens (Human)
Description:
P10635
Residue:
497
  
Inhibitor
Name:
BDBM155254
Synonyms:
US10098888, Compound 2 | US9006242, 2
Type:
Small organic molecule
Emp. Form.:
C35H51N5O4
Mol. Mass.:
605.8105
SMILES:
CCN([C@H]1CC[C@@H](CC1)N(C)CCOC)c1cc(cc(C(=O)NCc2c(C)cc(C)[nH]c2=O)c1C)C#CCN1CCOCC1
: