Target
Histone deacetylase 1
Ligand
BDBM218240
Substrate
Meas. Tech.
HDAC Activity Assay
pH
8±n/a
IC50
>30000±n/a nM
Comments
extracted
Citation
 Kozikowski, AKalin, JHButler, KVBergman, JHancock, WW HDAC inhibitors and therapeutic methods using the same US Patent  US9249087 Publication Date 2/2/2016 
Target
Name:
Histone deacetylase 1
Synonyms:
Cereblon/Histone deacetylase 1 HDAC1 Histone deacetylase 1 (HDAC1) RPD3L1
Type:
Enzyme
Mol. Mass.:
55090.27
Organism:
Homo sapiens (Human)
Description:
Q13547
Residue:
482
  
Inhibitor
Name:
BDBM218240
Synonyms:
US9249087, Table 1 , Compound 17
Type:
Small organic molecule
Emp. Form.:
C14H19NO3
Mol. Mass.:
249.3056
SMILES:
COC[C@H]1CCCC1c1ccc(cc1)C(=O)NO
: