Target
Histone deacetylase 8
Ligand
BDBM218225
Substrate
Meas. Tech.
HDAC Activity Assay
pH
8±n/a
IC50
397±n/a nM
Comments
extracted
Citation
 Kozikowski, AKalin, JHButler, KVBergman, JHancock, WW HDAC inhibitors and therapeutic methods using the same US Patent  US9249087 Publication Date 2/2/2016 
Target
Name:
Histone deacetylase 8
Synonyms:
HD8 HDAC8_HUMAN Histone deacetylase 8 (HDAC-8) | Human HDAC8
Type:
Enzyme
Mol. Mass.:
41749.60
Organism:
Homo sapiens (Human)
Description:
Q9BY41
Residue:
377
  
Inhibitor
Name:
BDBM218225
Synonyms:
US9249087, Table 1 , Compound 2
Type:
Small organic molecule
Emp. Form.:
C17H14NO2
Mol. Mass.:
264.2986
SMILES:
Cc1cc2ccccc2c1-c1ccc(cc1)C(=O)NO
: