Target
Histone deacetylase 1
Ligand
BDBM218176
Substrate
Meas. Tech.
HDAC Activity Assay
pH
8±n/a
IC50
5860±1190 nM
Comments
extracted
Citation
 Kozikowski, AKalin, JHButler, KVBergman, JHancock, WW HDAC inhibitors and therapeutic methods using the same US Patent  US9249087 Publication Date 2/2/2016 
Target
Name:
Histone deacetylase 1
Synonyms:
Cereblon/Histone deacetylase 1 HDAC1 Histone deacetylase 1 (HDAC1) RPD3L1
Type:
Enzyme
Mol. Mass.:
55090.27
Organism:
Homo sapiens (Human)
Description:
Q13547
Residue:
482
  
Inhibitor
Name:
BDBM218176
Synonyms:
US9249087, 19
Type:
Small organic molecule
Emp. Form.:
C20H23N3O2
Mol. Mass.:
337.4155
SMILES:
CN(C)CCc1cn(Cc2ccc(cc2)C(=O)NO)c2ccccc12
: