Target
RAC-alpha serine/threonine-protein kinase
Ligand
BDBM218246
Substrate
Meas. Tech.
Akt1 TR-FRET assay
pH
7.5±n/a
Temperature
295.15±n/a K
IC50
110±n/a nM
Comments
extracted
Citation
 Bärfacker, LScott, WHägebarth, AInce, SRehwinkel, HPolitz, ONeuhaus, RBömer, U Substituted imidazopyrazines as Akt kinase inhibitors US Patent  US9260435 Publication Date 2/16/2016 
Target
Name:
RAC-alpha serine/threonine-protein kinase
Synonyms:
AKT phosphorylation (p-AKT) AKT1/PPP1CA C-AKT PKB alpha Protein kinase B Protein kinase B (Akt 1) Protein kinase B alpha Proto-oncogene Akt (Akt1) Proto-oncogene c-Akt (AKT1) RAC-PK-alpha RAC-alpha serine/threonine-protein kinase (AKT1) | RAC-alpha serine/threonine-protein kinase (pAKT)
Type:
Enzyme
Mol. Mass.:
55681.25
Organism:
Homo sapiens (Human)
Description:
P31749
Residue:
480
  
Inhibitor
Name:
BDBM218246
Synonyms:
US9260435, 4
Type:
Small organic molecule
Emp. Form.:
C25H26N4O
Mol. Mass.:
398.5001
SMILES:
CCc1cn2c(c(nc2c(OC)n1)-c1ccc(cc1)C1(N)CCC1)-c1ccccc1
: