Target
Sodium-dependent dopamine transporter
Ligand
BDBM218671
Substrate
Meas. Tech.
Uptake Assay
IC50
8523±n/a nM
Citation
 Kortagere, SKuzhikandahil, EV D3 dopamine receptor agonists to treat dyskinesia in parkinson's disease US Patent  US9289400 Publication Date 3/22/2016 
Target
Name:
Sodium-dependent dopamine transporter
Synonyms:
DA transporter DAT1 Dopamine transporter protein (DAT) SC6A3_HUMAN Sodium-dependent dopamine transporter Solute carrier family 6 member 3
Type:
Multi-pass membrane protein
Mol. Mass.:
68497.11
Organism:
Homo sapiens (Human)
Description:
Q01959
Residue:
620
  
Inhibitor
Name:
BDBM218671
Synonyms:
US9289400, ES609
Type:
Small organic molecule
Emp. Form.:
C10H14ClN
Mol. Mass.:
183.678
SMILES:
CC(N)CCc1ccccc1Cl
: