Target
S-methyl-5'-thioinosine phosphorylase
Ligand
BDBM50247150
Substrate
Meas. Tech.
Inhibition Assay
pH
7.4±n/a
Temperature
298.15±n/a K
Ki
0.035±n/a nM
Comments
extracted
Citation
 Schramm, VLClinch, KTyler, PCEvans, GBFurneaux, RH Methods, assays and compounds for treating bacterial infections by inhibiting methylthioinosine phosphorylase US Patent  US9290501 Publication Date 3/22/2016 
Target
Name:
S-methyl-5'-thioinosine phosphorylase
Synonyms:
MTIP_PSEAE | S-methyl-5'-thioinosine phosphorylase (MTIP)
Type:
Enzyme
Mol. Mass.:
26266.70
Organism:
Pseudomonas aeruginosa
Description:
Q9HZK1
Residue:
245
  
Inhibitor
Name:
BDBM50247150
Synonyms:
5'-phenylthio-ImmH US9290501, (B)
Type:
Small organic molecule
Emp. Form.:
C17H18N4O3S
Mol. Mass.:
358.415
SMILES:
O[C@@H]1[C@@H](CSc2ccccc2)N[C@H]([C@@H]1O)c1c[nH]c2c1nc[nH]c2=O
: