Target
S-methyl-5'-thioinosine phosphorylase
Ligand
BDBM218676
Substrate
Meas. Tech.
Inhibition Assay
pH
7.4±n/a
Temperature
298.15±n/a K
Ki
0.34±20 nM
Comments
extracted
Citation
 Schramm, VLClinch, KTyler, PCEvans, GBFurneaux, RH Methods, assays and compounds for treating bacterial infections by inhibiting methylthioinosine phosphorylase US Patent  US9290501 Publication Date 3/22/2016 
Target
Name:
S-methyl-5'-thioinosine phosphorylase
Synonyms:
MTIP_PSEAE | S-methyl-5'-thioinosine phosphorylase (MTIP)
Type:
Enzyme
Mol. Mass.:
26266.70
Organism:
Pseudomonas aeruginosa
Description:
Q9HZK1
Residue:
245
  
Inhibitor
Name:
BDBM218676
Synonyms:
US9290501, MT-DADMe-ImmH
Type:
Small organic molecule
Emp. Form.:
C13H18N4O2S
Mol. Mass.:
294.373
SMILES:
CSCC1CN(Cc2c[nH]c3c2nc[nH]c3=O)CC1O
: