Target
Nuclear receptor ROR-gamma
Ligand
BDBM218781
Substrate
Meas. Tech.
In vitro RORc Ligand Binding Assay
pH
7.4±n/a
Temperature
298.15±n/a K
IC50
20±n/a nM
Comments
extracted
Citation
 Fauber, BRene, OBodil van Niel, MWard, S Benzyl sulfonamide derivatives as RORc modulators US Patent  US9302985 Publication Date 4/5/2016 
Target
Name:
Nuclear receptor ROR-gamma
Synonyms:
NR1F3 Nuclear receptor ROR-gamma (RORC) RAR-related orphan receptor C (RORc) RORG RZRG Retinoid-related orphan receptor-gamma (RORc)
Type:
Enzyme Catalytic Domain
Mol. Mass.:
58218.40
Organism:
Homo sapiens (Human)
Description:
P51449
Residue:
518
  
Inhibitor
Name:
BDBM218781
Synonyms:
US9302985, 11
Type:
Small organic molecule
Emp. Form.:
C23H24ClNO4S2
Mol. Mass.:
478.024
SMILES:
CC(C)CN(c1ccc(Cl)cc1)S(=O)(=O)c1ccc(cc1)-c1ccc(cc1)S(C)(=O)=O
: