Target
Bcl-2-related protein A1 [1-149]
Ligand
BDBM218792
Substrate
Meas. Tech.
DELFIA
IC50
>1e+3±n/a nM
Citation
 Barile, EMarconi, GDDe, SKBaggio, CGambini, LSalem, AFKashyap, MKCastro, JEKipps, TJPellecchia, M hBfl-1/hNOXA Interaction Studies Provide New Insights on the Role of Bfl-1 in Cancer Cell Resistance and for the Design of Novel Anticancer Agents. ACS Chem Biol 12:444-455 (2017)  
Target
Name:
Bcl-2-related protein A1 [1-149]
Synonyms:
B2LA1_HUMAN BCL2L5 Bcl2-related protein A1 (Bfl-1) HBPA1
Type:
Protein
Mol. Mass.:
19694.10
Organism:
Homo sapiens (Human)
Description:
Human Bfl-1 truncation (1-149 aa) with N-terminal His-tag.
Residue:
171
  
Inhibitor
Name:
BDBM218792
Synonyms:
Ac-AELPPEFAAQLRKIGDKVYC-NH2 | NOXA A
Type:
Small organic molecule
Emp. Form.:
C104H165N27O29S
Mol. Mass.:
2289.651
SMILES:
CC[C@H](C)[C@H](NC(=O)[C@H](CCCCN)NC(=O)[C@H](CCCNC(N)=N)NC(=O)[C@H](CC(C)C)NC(=O)[C@H](CCC(N)=O)NC(=O)[C@H](C)NC(=O)[C@H](C)NC(=O)[C@H](Cc1ccccc1)NC(=O)[C@H](CCC(O)=O)NC(=O)[C@@H]1CCCN1C(=O)[C@@H]1CCCN1C(=O)[C@H](CC(C)C)NC(=O)[C@H](CCC(O)=O)NC(=O)[C@H](C)NC(C)=O)C(=O)NCC(=O)N[C@@H](CC(O)=O)C(=O)N[C@@H](CCCCN)C(=O)N[C@@H](C(C)C)C(=O)N[C@@H](Cc1ccc(O)cc1)C(=O)N[C@@H](CS)C(N)=O
: