Target
Metabotropic glutamate receptor 2
Ligand
BDBM160719
Substrate
Meas. Tech.
MGluR2 cAMP Assay
pH
7±n/a
EC50
286±n/a nM
Comments
extracted
Citation
 Mattson, RJMeng, ZGuernon, LR Positive allosteric modulators of mGluR2 US Patent  US9682980 Publication Date 6/20/2017 
Target
Name:
Metabotropic glutamate receptor 2
Synonyms:
GPRC1B GRM2_HUMAN Metabotropic glutamate receptor mGlu2 | metabotropic glutamate 2
Type:
Enzyme
Mol. Mass.:
95584.88
Organism:
Homo sapiens (Human)
Description:
Q14416
Residue:
872
  
Inhibitor
Name:
BDBM160719
Synonyms:
US9682980, 7-(4-(4-Fluorophenyl)piperidin-1-yl)-8-methoxy-3-neopentyl-[1,2,4]triazolo[4,3-c]pyrimidine
Type:
Small organic molecule
Emp. Form.:
C22H28FN5O
Mol. Mass.:
397.489
SMILES:
COc1c(ncn2c(CC(C)(C)C)nnc12)N1CCC(CC1)c1ccc(F)cc1
: