Target
Metabotropic glutamate receptor 2
Ligand
BDBM160720
Substrate
Meas. Tech.
MGluR2 cAMP Assay
pH
7±n/a
EC50
782±n/a nM
Comments
extracted
Citation
 Mattson, RJMeng, ZGuernon, LR Positive allosteric modulators of mGluR2 US Patent  US9682980 Publication Date 6/20/2017 
Target
Name:
Metabotropic glutamate receptor 2
Synonyms:
GPRC1B GRM2_HUMAN Metabotropic glutamate receptor mGlu2 | metabotropic glutamate 2
Type:
Enzyme
Mol. Mass.:
95584.88
Organism:
Homo sapiens (Human)
Description:
Q14416
Residue:
872
  
Inhibitor
Name:
BDBM160720
Synonyms:
US9682980, 1-(3-(Cyclopropylmethyl)-8-methoxy-[1,2,4]triazolo[4,3-c]pyrimidin-7-yl)-4-(4-fluorophenyl)piperidin-4-ol
Type:
Small organic molecule
Emp. Form.:
C20H21ClFN5O
Mol. Mass.:
401.865
SMILES:
OC1(CCN(CC1)c1ncn2c(CC3CC3)nnc2c1Cl)c1ccc(F)cc1
: