Target
Metabotropic glutamate receptor 2
Ligand
BDBM160767
Substrate
Meas. Tech.
MGluR2 cAMP Assay
pH
7±n/a
EC50
144±n/a nM
Comments
extracted
Citation
 Mattson, RJMeng, ZGuernon, LR Positive allosteric modulators of mGluR2 US Patent  US9682980 Publication Date 6/20/2017 
Target
Name:
Metabotropic glutamate receptor 2
Synonyms:
GPRC1B GRM2_HUMAN Metabotropic glutamate receptor mGlu2 | metabotropic glutamate 2
Type:
Enzyme
Mol. Mass.:
95584.88
Organism:
Homo sapiens (Human)
Description:
Q14416
Residue:
872
  
Inhibitor
Name:
BDBM160767
Synonyms:
US9682980, 8-Chloro-3-(cyclopropylmethyl)-7-(4-(3,5-dichlorophenyl)piperidin-1-yl)-[1,2,4]triazolo[4,3-b]pyridazine
Type:
Small organic molecule
Emp. Form.:
C20H20Cl3N5
Mol. Mass.:
436.765
SMILES:
Clc1cc(Cl)cc(c1)C1CCN(CC1)c1cnn2c(CC3CC3)nnc2c1Cl
: