Target
Metabotropic glutamate receptor 2
Ligand
BDBM160791
Substrate
Meas. Tech.
MGluR2 cAMP Assay
pH
7±n/a
EC50
185±n/a nM
Comments
extracted
Citation
 Mattson, RJMeng, ZGuernon, LR Positive allosteric modulators of mGluR2 US Patent  US9682980 Publication Date 6/20/2017 
Target
Name:
Metabotropic glutamate receptor 2
Synonyms:
GPRC1B GRM2_HUMAN Metabotropic glutamate receptor mGlu2 | metabotropic glutamate 2
Type:
Enzyme
Mol. Mass.:
95584.88
Organism:
Homo sapiens (Human)
Description:
Q14416
Residue:
872
  
Inhibitor
Name:
BDBM160791
Synonyms:
US9682980, 1′-(8-Chloro-3-(2,2,2-trifluoroethyl)-[1,2,4]triazolo[4,3-b]pyridazin-7-yl)-2H-spiro[benzofuran-3,4′-piperidin]-2-one
Type:
Small organic molecule
Emp. Form.:
C19H17ClF3N5O2
Mol. Mass.:
439.819
SMILES:
FC(F)(F)Cc1nnc2c(Cl)c(cnn12)N1CCC2(CC1)C1C=CC=CC1OC2=O
: