Target
Cyclin-dependent kinase 4/G1/S-specific cyclin-D1
Ligand
BDBM6043
Substrate
GST-Rb fusion protein
Meas. Tech.
Kinase Inhibition assay
pH
7.6±n/a
Temperature
295.15±n/a K
IC50
150±n/a nM
Citation
 Yue, EWDiMeo, SVHigley, CAMarkwalder, JABurton, CRBenfield, PAGrafstrom, RHCox, SMuckelbauer, JKSmallwood, AMChen, HChang, CHTrainor, GLSeitz, SP Synthesis and evaluation of indenopyrazoles as cyclin-dependent kinase inhibitors. Part 4: Heterocycles at C3. Bioorg Med Chem Lett 14:343-6 (2004)  
Target
Name:
Cyclin-dependent kinase 4/G1/S-specific cyclin-D1
Synonyms:
CDK4/CycD CDK4/Cyclin D1 Cyclin-Dependent Kinase 4 (CDK4) Cyclin-dependent kinase 4/G1/S-specific cyclin D1 | Cyclin-dependent kinase 4/cyclin D1
Type:
Protein Complex
Mol. Mass.:
Description:
CDK4/D1 complexes were purified from insect cells co-infected with baculovirus vectors containing each of the components.
Components:
This complex has 2 components.
Component 1
Name:
Cyclin-dependent kinase 4
Synonyms:
CDK4 Cell division protein kinase 4 PSK-J3
Type:
Enzyme Subunit
Mol. Mass.:
33731.96
Organism:
Homo sapiens (Human)
Description:
P11802
Residue:
303
  
Component 2
Name:
G1/S-specific cyclin-D1
Synonyms:
B-cell lymphoma 1 protein BCL-1 oncogene CCND1 PRAD1 | PRAD1 oncogene
Type:
Enzyme Subunit
Mol. Mass.:
33717.70
Organism:
Homo sapiens (Human)
Description:
Residue:
295
  
Inhibitor
Name:
BDBM6043
Synonyms:
1-[3-(2,4-dimethyl-1,3-thiazol-5-yl)-4-oxo-2H,4H-indeno[1,2-c]pyrazol-5-yl]-3-(dimethylamino)urea | C3 heterocyle indenopyrazole 8i
Type:
Small organic molecule
Emp. Form.:
C18H18N6O2S
Mol. Mass.:
382.44
SMILES:
CN(C)NC(=O)Nc1cccc2-c3n[nH]c(-c4sc(C)nc4C)c3C(=O)c12
:
Substrate
Name:
GST-Rb fusion protein
Synonyms:
Glutathione S-transferase (GST)-retinoblastoma (Rb) fusion RB1 Rb | retinoblastoma
Type:
Other Protein Type
Mol. Mass.:
106410.17
Organism:
Homo sapiens (Human)
Description:
GST-60 kDa Rb fusion protein (comprising amino acids 378 to 928 of retinoblastoma)
Residue:
928