Target
Cyclin-dependent kinase 2/G1/S-specific cyclin-E1
Ligand
BDBM6036
Substrate
GST-Rb fusion protein
Meas. Tech.
Kinase Inhibition assay
IC50
32±n/a nM
Citation
 Yue, EWDiMeo, SVHigley, CAMarkwalder, JABurton, CRBenfield, PAGrafstrom, RHCox, SMuckelbauer, JKSmallwood, AMChen, HChang, CHTrainor, GLSeitz, SP Synthesis and evaluation of indenopyrazoles as cyclin-dependent kinase inhibitors. Part 4: Heterocycles at C3. Bioorg Med Chem Lett 14:343-6 (2004)  
Target
Name:
Cyclin-dependent kinase 2/G1/S-specific cyclin-E1
Synonyms:
CDK2/CycE CDK2/E Cyclin-Dependent Kinase 2 (CDK2) Cyclin-dependent kinase 2/cyclin E1
Type:
Protein
Mol. Mass.:
Description:
Components:
This complex has 2 components.
Component 1
Name:
Cyclin-dependent kinase 2
Synonyms:
CDK2 CDK2_HUMAN Cell division protein kinase 2 Protein cereblon/Cyclin-dependent kinase 2 | p33 protein kinase
Type:
Enzyme Subunit
Mol. Mass.:
33938.17
Organism:
Homo sapiens (Human)
Description:
P24941
Residue:
298
  
Component 2
Name:
G1/S-specific cyclin-E1
Synonyms:
CCNE CCNE1_HUMAN
Type:
Enzyme Subunit
Mol. Mass.:
47073.17
Organism:
Homo sapiens (Human)
Description:
Residue:
410
  
Inhibitor
Name:
BDBM6036
Synonyms:
3-(dimethylamino)-1-[3-(5-methoxythiophen-2-yl)-4-oxo-2H,4H-indeno[1,2-c]pyrazol-5-yl]urea | C3 heterocyle indenopyrazole 8b
Type:
Small organic molecule
Emp. Form.:
C18H17N5O3S
Mol. Mass.:
383.424
SMILES:
COc1ccc(s1)-c1[nH]nc2-c3cccc(NC(=O)NN(C)C)c3C(=O)c12
:
Substrate
Name:
GST-Rb fusion protein
Synonyms:
Glutathione S-transferase (GST)-retinoblastoma (Rb) fusion RB1 Rb | retinoblastoma
Type:
Other Protein Type
Mol. Mass.:
106410.17
Organism:
Homo sapiens (Human)
Description:
GST-60 kDa Rb fusion protein (comprising amino acids 378 to 928 of retinoblastoma)
Residue:
928