Target
Neurotensin receptor type 1 [45-272,291-390,C386A,C388A]
Ligand
BDBM218811
Substrate
Meas. Tech.
SPR Screening Assay
Kd
1.0e+3± 1e+2 nM
Citation
 Ranganathan, AHeine, PRudling, APlückthun, AKummer, LCarlsson, J Ligand Discovery for a Peptide-Binding GPCR by Structure-Based Screening of Fragment- and Lead-Like Chemical Libraries. ACS Chem Biol 12:735-745 (2017)  
Target
Name:
Neurotensin receptor type 1 [45-272,291-390,C386A,C388A]
Synonyms:
NTR1_HUMAN NTSR1 | Neurotensin receptor type 1 (NTSR1-H4)
Type:
Protein
Mol. Mass.:
36530.59
Organism:
Rattus norvegicus (Rat)
Description:
Rat NTSR1 variant (E45-G390 aa with C386A/C388A mutation) lacking intracellular loop 3 (E273-T290)
Residue:
328
  
Inhibitor
Name:
BDBM218811
Synonyms:
NTSR-H4 inhibitor, 1
Type:
Small organic molecule
Emp. Form.:
C14H19ClN2O3
Mol. Mass.:
298.765
SMILES:
CC(C)C[C@H](NC(=O)NCc1ccccc1Cl)C(O)=O
: