Target
Lipoxygenase
Ligand
BDBM22334
Substrate
Meas. Tech.
Colorimetric 5-LO Assay
IC50
1.71e+4±n/a nM
Citation
 Richardson-Sanchez, TTieu, WCodd, R Reverse Biosynthesis: Generating Combinatorial Pools of Drug Leads from Enzyme-Mediated Fragmentation of Natural Products. Chembiochem 18:368-373 (2017)  
Target
Name:
Lipoxygenase
Synonyms:
5-Lipoxygenase | 5-Lipoxygenase (5-LO)
Type:
Enzyme
Mol. Mass.:
97294.59
Organism:
Solanum tuberosum (potato)
Description:
Residue:
864
  
Inhibitor
Name:
BDBM22334
Synonyms:
BW A4C BWA4C CHEMBL314360 N-(3-phenoxycinnamyl)acetohydroxamic acid | N-hydroxy-N-[(2E)-3-(3-phenoxyphenyl)prop-2-en-1-yl]acetamide
Type:
Small organic molecule
Emp. Form.:
C17H17NO3
Mol. Mass.:
283.3218
SMILES:
CC(=O)N(O)C\C=C\c1cccc(Oc2ccccc2)c1
: