Target
Casein kinase II subunit alpha/beta
Ligand
BDBM219896
Substrate
BDBM220098
Meas. Tech.
In Vitro Cell-Free Assay
pH
7.2±n/a
IC50
<10±n/a nM
Comments
extracted
Citation
 Haddach, MTran, JAPierre, FRegan, CFRaffaele, NRavula, SRyckman, DM Pyrazolopyrimidines and related heterocycles as CK2 inhibitors US Patent  US9303033 Publication Date 4/5/2016 
Target
Name:
Casein kinase II subunit alpha/beta
Synonyms:
Casein kinase 2 (CK2) Casein kinase II subunit alpha alpha beta beta | Complex of catalytic (CK2α) and non-catalytic (CK2β) subunits
Type:
Mol. Mass.:
Description:
ASSAY_ID of ChEMBL is 989485
Components:
This complex has 2 components.
Component 1
Name:
Casein kinase II subunit alpha
Synonyms:
CK II CK2- alpha CSK21_HUMAN Casein kinase 2 Casein kinase II alpha/beta Casein kinase II subunit alpha (CK2A1) Casein kinase II subunit alpha (CK2a V66A) Casein kinase II subunit alpha (CK2a)
Type:
Enzyme
Mol. Mass.:
45151.12
Organism:
Homo sapiens (Human)
Description:
P68400
Residue:
391
  
Component 2
Name:
Casein kinase II subunit beta
Synonyms:
CK II beta Casein kinase II beta Ck2n Phosvitin
Type:
PROTEIN
Mol. Mass.:
24937.13
Organism:
Rattus norvegicus
Description:
EBI_10969
Residue:
215
  
Inhibitor
Name:
BDBM219896
Synonyms:
US9303033, Y41, Table 46A, Compound 3
Type:
Small organic molecule
Emp. Form.:
C19H14ClN9O2
Mol. Mass.:
435.827
SMILES:
Clc1cc(cnc1Nc1cc(NC2CC2)n2ncc(\C=C3/NC(=O)NC3=O)c2n1)C#N
:
Substrate
Name:
BDBM220098
Synonyms:
US9303033, RRRDDDSDDD
Type:
Peptide Substrate
Emp. Form.:
C45H79N19O24
Mol. Mass.:
1270.2217
SMILES:
NC(N)NCCC[C@H](N)C(=O)N[C@@H](CCCNC(N)N)C(=O)N[C@@H](CCCNC(N)N)C(=O)N[C@@H](CC(O)=O)C(=O)N[C@@H](CC(O)=O)C(=O)N[C@@H](CC(O)=O)C(=O)N[C@@H](CO)C(=O)N[C@@H](CC(O)=O)C(=O)N[C@@H](CC(O)=O)C(=O)N[C@@H](CC(O)=O)C(O)=O
: