Target
Casein kinase II subunit beta
Ligand
BDBM218947
Substrate
BDBM220103
Meas. Tech.
Inhibition Assay
pH
7±n/a
IC50
>2500.0±n/a nM
Comments
extracted
Citation
 Haddach, MTran, JAPierre, FRegan, CFRaffaele, NRavula, SRyckman, DM Pyrazolopyrimidines and related heterocycles as CK2 inhibitors US Patent  US9303033 Publication Date 4/5/2016 
Target
Name:
Casein kinase II subunit beta
Synonyms:
CK2N CSNK2B Casein kinase II subunit beta (CK2 beta) G5A | Serine/threonine-protein kinase pim-2
Type:
Enzyme
Mol. Mass.:
24937.13
Organism:
Homo sapiens (Human)
Description:
P67870
Residue:
215
  
Inhibitor
Name:
BDBM218947
Synonyms:
US9303033, B5, Table 13A, Compound 36 | US9303033, Y7, Table 22A, Compound 19
Type:
Small organic molecule
Emp. Form.:
C20H18N6O3
Mol. Mass.:
390.3953
SMILES:
COc1cccc(c1)-c1cc(NC2CC2)n2ncc(\C=C3/NC(=O)NC3=O)c2n1
:
Substrate
Name:
BDBM220103
Synonyms:
US9303033, RSRSSYPAGT
Type:
Peptide Substrate
Emp. Form.:
C44H77N16O15
Mol. Mass.:
1070.1798
SMILES:
CC(O)C(NC(=O)CNC(=O)[C@H](C)NC(=O)[C@@H]1CCCN1C(=O)[C@H](Cc1ccc(O)cc1)NC(=O)[C@H](CO)NC(=O)[C@H](CO)NC(=O)[C@H](CCCNC(N)N)NC(=O)[C@H](CO)NC(=O)[C@@H]([NH3+])CCCNC(N)N)C=O
: