Target
Tyrosine-protein kinase BTK
Ligand
BDBM260572
Substrate
Meas. Tech.
Inhibition Assay of BTK Kinase Activity
Temperature
298.15±n/a K
IC50
21.0±n/a nM
Comments
extracted
Citation
 He, W Pharmaceutical compositions and their use for treatment of cancer and autoimmune diseases US Patent  US10098900 Publication Date 10/16/2018 
Target
Name:
Tyrosine-protein kinase BTK
Synonyms:
AGMX1 Agammaglobulinaemia tyrosine kinase B cell progenitor kinase BPK BTK_HUMAN Tyrosine Kinase BTK Tyrosine-protein kinase BTK (BTK)
Type:
Enzyme
Mol. Mass.:
76289.95
Organism:
Homo sapiens (Human)
Description:
Q06187
Residue:
659
  
Inhibitor
Name:
BDBM260572
Synonyms:
US10098900, Compound 4 US9532990, 46 | US9717745, 4
Type:
Small organic molecule
Emp. Form.:
C24H17F5N6O2
Mol. Mass.:
516.4228
SMILES:
Nc1ncnc2n(nc(-c3ccc(Oc4c(F)c(F)cc(F)c4F)cc3F)c12)[C@H]1CCN(C1)C(=O)C=C
: