Target
Aldo-keto reductase family 1 member C3
Ligand
BDBM220119
Substrate
Meas. Tech.
Discontinuous Radiometric Assay
IC50
6400±n/a nM
Citation
 Penning, TMAdeniji, AOBurns, MCWinkler, JTwenter, B Bifunctional AKR1C3 inhibitors/androgen receptor modulators and methods of use thereof US Patent  US9271961 Publication Date 3/1/2016 
Target
Name:
Aldo-keto reductase family 1 member C3
Synonyms:
17-beta-Hydroxysteroid Dehydrogenase 5 (17-beta-HSD5, AKR1C3) AK1C3_HUMAN Aldo-keto reductase family 1 member C3 Aldo-keto reductase family 1 member C3 (AK1C3a) Aldo-keto-reductase family 1 member C3 Dihydrodiol dehydrogenase 3 Estradiol 17-beta-dehydrogenase KIAA0119 Prostaglandin F synthase Trans-1,2-dihydrobenzene-1,2-diol dehydrogenase
Type:
Enzyme
Mol. Mass.:
36859.86
Organism:
Homo sapiens (Human)
Description:
P42330
Residue:
323
  
Inhibitor
Name:
BDBM220119
Synonyms:
US9271961, alpha-Mehtylcinnamic acid
Type:
Small organic molecule
Emp. Form.:
C10H10O2
Mol. Mass.:
162.1852
SMILES:
C\C(=C/c1ccccc1)C(O)=O
: