Target
Aldo-keto reductase family 1 member C2
Ligand
BDBM50337287
Substrate
Meas. Tech.
Discontinuous Radiometric Assay
IC50
11000±n/a nM
Citation
 Penning, TMAdeniji, AOBurns, MCWinkler, JTwenter, B Bifunctional AKR1C3 inhibitors/androgen receptor modulators and methods of use thereof US Patent  US9271961 Publication Date 3/1/2016 
Target
Name:
Aldo-keto reductase family 1 member C2
Synonyms:
3-alpha-HSD3 AK1C2_HUMAN Aldo-keto reductase family 1 member C2 (AK1C2) Aldo-keto reductase family 1 member C2 (AKR1C2) DD-2 DDH2 Dihydrodiol dehydrogenase/bile acid-binding protein Type III 3-alpha-hydroxysteroid dehydrogenase
Type:
Enzyme
Mol. Mass.:
36739.89
Organism:
Homo sapiens (Human)
Description:
Residue:
323
  
Inhibitor
Name:
BDBM50337287
Synonyms:
3-[N-(4-methoxyphenyl)amino]benzoic acid US9271961, 11
Type:
Small organic molecule
Emp. Form.:
C14H13NO3
Mol. Mass.:
243.2579
SMILES:
COc1ccc(Nc2cccc(c2)C(O)=O)cc1
: