Target
Aldo-keto reductase family 1 member B1
Ligand
BDBM50337285
Substrate
Meas. Tech.
Discontinuous Radiometric Assay
IC50
>50000±n/a nM
Citation
 Penning, TMAdeniji, AOBurns, MCWinkler, JTwenter, B Bifunctional AKR1C3 inhibitors/androgen receptor modulators and methods of use thereof US Patent  US9271961 Publication Date 3/1/2016 
Target
Name:
Aldo-keto reductase family 1 member B1
Synonyms:
AKR1B1 ALDR_HUMAN AR Aldose Reductase (ALR2) Aldose reductase (AR)
Type:
Protein
Mol. Mass.:
35855.50
Organism:
Homo sapiens (Human)
Description:
P15121. 4LAU; 2IKI; 4LB4; 2FZD; 2FZ8; 1US0
Residue:
316
  
Inhibitor
Name:
BDBM50337285
Synonyms:
3-[N-(4-bromophenyl)amino]benzoic acid US9271961, 9
Type:
Small organic molecule
Emp. Form.:
C13H10BrNO2
Mol. Mass.:
292.128
SMILES:
OC(=O)c1cccc(Nc2ccc(Br)cc2)c1
: