Target
Aldo-keto reductase family 1 member B10
Ligand
BDBM50337281
Substrate
Meas. Tech.
Discontinuous Radiometric Assay
IC50
46000±n/a nM
Citation
 Penning, TMAdeniji, AOBurns, MCWinkler, JTwenter, B Bifunctional AKR1C3 inhibitors/androgen receptor modulators and methods of use thereof US Patent  US9271961 Publication Date 3/1/2016 
Target
Name:
Aldo-keto reductase family 1 member B10
Synonyms:
AK1BA_HUMAN AKR1B11 ARP Aldo-keto reductase family 1 member B10 (AKR1B10) Aldose reductase-like SI reductase hARP
Type:
Protein
Mol. Mass.:
36024.67
Organism:
Homo sapiens (Human)
Description:
O60218. 1ZUA; 4JII; 4GQ0
Residue:
316
  
Inhibitor
Name:
BDBM50337281
Synonyms:
3-[N-(4-nitrophenyl)amino]benzoic acid US9271961, 5
Type:
Small organic molecule
Emp. Form.:
C13H10N2O4
Mol. Mass.:
258.2295
SMILES:
OC(=O)c1cccc(Nc2ccc(cc2)[N+]([O-])=O)c1
: