Target
Aldo-keto reductase family 1 member B10
Ligand
BDBM220115
Substrate
Meas. Tech.
Discontinuous Radiometric Assay
IC50
>30000±n/a nM
Citation
 Penning, TMAdeniji, AOBurns, MCWinkler, JTwenter, B Bifunctional AKR1C3 inhibitors/androgen receptor modulators and methods of use thereof US Patent  US9271961 Publication Date 3/1/2016 
Target
Name:
Aldo-keto reductase family 1 member B10
Synonyms:
AK1BA_HUMAN AKR1B11 ARP Aldo-keto reductase family 1 member B10 (AKR1B10) Aldose reductase-like SI reductase hARP
Type:
Protein
Mol. Mass.:
36024.67
Organism:
Homo sapiens (Human)
Description:
O60218. 1ZUA; 4JII; 4GQ0
Residue:
316
  
Inhibitor
Name:
BDBM220115
Synonyms:
US9271961, 13
Type:
Small organic molecule
Emp. Form.:
C18H14N2O4
Mol. Mass.:
322.3148
SMILES:
COC(=O)c1cccc(Nc2ccc([N+]([O-])=O)c3ccccc23)c1
: