Target
Prostaglandin G/H synthase 1
Ligand
BDBM17636
Substrate
Meas. Tech.
Discontinuous Radiometric Assay
IC50
2230±n/a nM
Citation
 Penning, TMAdeniji, AOBurns, MCWinkler, JTwenter, B Bifunctional AKR1C3 inhibitors/androgen receptor modulators and methods of use thereof US Patent  US9271961 Publication Date 3/1/2016 
Target
Name:
Prostaglandin G/H synthase 1
Synonyms:
COX-1 Cyclooxygenase Cyclooxygenase-1 (COX-1) PTGS1 | Prostaglandin G/H synthase (cyclooxygenase)
Type:
Enzyme
Mol. Mass.:
68692.62
Organism:
Homo sapiens (Human)
Description:
P23219
Residue:
599
  
Inhibitor
Name:
BDBM17636
Synonyms:
2-{[3-(trifluoromethyl)phenyl]amino}benzoic acid CHEMBL23588 Nichisedan US9271961, Flufenamic Acid
Type:
Small organic molecule
Emp. Form.:
C14H10F3NO2
Mol. Mass.:
281.2299
SMILES:
OC(=O)c1ccccc1Nc1cccc(c1)C(F)(F)F
: