Target
Cytochrome P450 11B1, mitochondrial
Ligand
BDBM8894
Substrate
BDBM8582
Meas. Tech.
Inhibition Assay
Temperature
310.15±n/a K
IC50
503±n/a nM
Comments
extracted
Citation
 Hartmann, RVoets, MMüller-Vieira, U Selective inhibitors of human corticosteroid synthases US Patent  US9271963 Publication Date 3/1/2016 
Target
Name:
Cytochrome P450 11B1, mitochondrial
Synonyms:
C11B1_HUMAN CYPXIB1 Cytochrome P450 11B1 Cytochrome P450 11B1, mitochondrial | S11BH
Type:
Enzyme
Mol. Mass.:
57591.44
Organism:
Homo sapiens (Human)
Description:
P15538
Residue:
503
  
Inhibitor
Name:
BDBM8894
Synonyms:
3-(3-Methyl-3,4-dihydronaphthalen-2-yl)pyridine US9271963, 40
Type:
Small organic molecule
Emp. Form.:
C16H15N
Mol. Mass.:
221.297
SMILES:
CC1Cc2ccccc2C=C1c1cccnc1
:
Substrate
Name:
BDBM8582
Synonyms:
(1S,2R,10S,11S,14S,15S)-14-(2-hydroxyacetyl)-2,15-dimethyltetracyclo[8.7.0.0^{2,7}.0^{11,15}]heptadec-6-en-5-one 21-hydroxypregn-4-ene-3,20-dione [4-14C]-11-deoxycorticosterone | deoxycorticosterone
Type:
Small organic molecule
Emp. Form.:
C21H30O3
Mol. Mass.:
330.4611
SMILES:
[H][C@@]12CC[C@H](C(=O)CO)[C@@]1(C)CC[C@@]1([H])[C@@]2([H])CCC2=CC(=O)CC[C@]12C
: