Target
Cytochrome P450 11B2, mitochondrial
Ligand
BDBM8908
Substrate
BDBM8582
Meas. Tech.
Inhibition Assay
Temperature
310.15±n/a K
IC50
12±n/a nM
Comments
extracted
Citation
 Hartmann, RVoets, MMüller-Vieira, U Selective inhibitors of human corticosteroid synthases US Patent  US9271963 Publication Date 3/1/2016 
Target
Name:
Cytochrome P450 11B2, mitochondrial
Synonyms:
Aldosterone Synthase (CYP11B2) Aldosterone-synthesizing enzyme CYP11B2 Cytochrome P450 11B2 Cytochrome P450 11B2, mitochondrial P-450C18 | Steroid 18-hydroxylase
Type:
Protein
Mol. Mass.:
57582.15
Organism:
Homo sapiens (Human)
Description:
P19099
Residue:
503
  
Inhibitor
Name:
BDBM8908
Synonyms:
3-(6-Ethoxy-2-naphthyl)pyridine Pyridine-substituted naphthalene 5 | US9271963, 5
Type:
Small organic molecule
Emp. Form.:
C17H15NO
Mol. Mass.:
249.3071
SMILES:
CCOc1ccc2cc(ccc2c1)-c1cccnc1
:
Substrate
Name:
BDBM8582
Synonyms:
(1S,2R,10S,11S,14S,15S)-14-(2-hydroxyacetyl)-2,15-dimethyltetracyclo[8.7.0.0^{2,7}.0^{11,15}]heptadec-6-en-5-one 21-hydroxypregn-4-ene-3,20-dione [4-14C]-11-deoxycorticosterone | deoxycorticosterone
Type:
Small organic molecule
Emp. Form.:
C21H30O3
Mol. Mass.:
330.4611
SMILES:
[H][C@@]12CC[C@H](C(=O)CO)[C@@]1(C)CC[C@@]1([H])[C@@]2([H])CCC2=CC(=O)CC[C@]12C
: