Target
Aromatase
Ligand
BDBM8912
Substrate
BDBM8592
Meas. Tech.
CYP19 Inhibition Assay
pH
7.4±n/a
IC50
970±n/a nM
Comments
extracted
Citation
 Hartmann, RVoets, MMüller-Vieira, U Selective inhibitors of human corticosteroid synthases US Patent  US9271963 Publication Date 3/1/2016 
Target
Name:
Aromatase
Synonyms:
ARO1 CP19A_HUMAN CYP19 CYPXIX Cytochrome P450 19A1 Cytochrome P450-C19 (CYP19) FL cytokine receptor precursor | P-450AROM
Type:
Enzyme
Mol. Mass.:
57888.92
Organism:
Homo sapiens (Human)
Description:
P11511
Residue:
503
  
Inhibitor
Name:
BDBM8912
Synonyms:
3-(1,5-Dichloro-6-methoxy-2-naphthyl)pyridine Pyridine-substituted naphthalene 12 | US9271963, 12
Type:
Small organic molecule
Emp. Form.:
C16H11Cl2NO
Mol. Mass.:
304.171
SMILES:
COc1ccc2c(Cl)c(ccc2c1Cl)-c1cccnc1
:
Substrate
Name:
BDBM8592
Synonyms:
(2R,15S)-2,15-dimethyltetracyclo[8.7.0.0^{2,7}.0^{11,15}]heptadec-6-ene-5,14-dione Androst-4-ene-3,17-dione [1beta-3H] androstenedione
Type:
Small organic molecule
Emp. Form.:
C19H26O2
Mol. Mass.:
286.4085
SMILES:
C[C@]12CCC3C(CCC4=CC(=O)CC[C@]34C)C1CCC2=O
: